Target
Tyrosine-protein kinase SYK
Ligand
BDBM255521
Substrate
Meas. Tech.
Biochemical Assay
pH
7.4±n/a
Temperature
298.15±n/a K
IC50
169.5±n/a nM
Comments
extracted
Citation
 Singh, RArgade, APayan, DGMolineaux, SHolland, SJClough, JKeim, HBhamidipati, SSylvain, CLi, HRossi, AB 2,4-pyrimidinediamine compounds and their uses US Patent  US9499493 Publication Date 11/22/2016 
Target
Name:
Tyrosine-protein kinase SYK
Synonyms:
KSYK_HUMAN Spleen Tyrosine Kinase Tyrosine-protein kinase SYK (Syk)
Type:
Enzyme
Mol. Mass.:
72079.99
Organism:
Homo sapiens (Human)
Description:
P43405
Residue:
635
  
Inhibitor
Name:
BDBM255521
Synonyms:
N4-(3-Chloro-4-methoxyphenyl)-5-fluoro-N2-[3-[(N-methylamino)carbonylmethyleneoxy]phenyl]-2,4-pyrimidinediamine | US9499493, R926891
Type:
Small organic molecule
Emp. Form.:
C21H23ClFN5O3
Mol. Mass.:
447.89
SMILES:
CNC(=O)COC1=C(C)CCC(Nc2ncc(F)c(Nc3ccc(OC)c(Cl)c3)n2)=C1
: