Target
Phosphatidylinositol 4,5-bisphosphate 3-kinase catalytic subunit gamma isoform
Ligand
BDBM255531
Substrate
Meas. Tech.
Time-Resolved Fluorescence Resonance Energy Transfer (TR-FRET) Assay
pH
7.4±n/a
Temperature
298.15±n/a K
IC50
>10000±n/a nM
Comments
extracted
Citation
 Kim, MPerreault, SYeung, SC Phosphatidylinositol 3-kinase inhibitors US Patent  US9499523 Publication Date 11/22/2016 
Target
Name:
Phosphatidylinositol 4,5-bisphosphate 3-kinase catalytic subunit gamma isoform
Synonyms:
PI3-kinase p110 subunit gamma PI3Kgamma PK3CG_HUMAN Phosphatidylinositol 4,5-bisphosphate 3-kinase (PI3K) Phosphatidylinositol 4,5-bisphosphate 3-kinase catalytic subunit gamma (PI3Kgamma) Phosphatidylinositol 4,5-bisphosphate 3-kinase catalytic subunit gamma isoform (PI3K) Phosphatidylinositol-4,5-bisphosphate 3-kinase catalytic subunit gamma isoform Phosphoinositide 3-kinases gamma (PI3K gamma) p120-PI3K
Type:
Enzyme Subunit
Mol. Mass.:
126470.30
Organism:
Homo sapiens (Human)
Description:
P48736
Residue:
1102
  
Inhibitor
Name:
BDBM255531
Synonyms:
US9499523, 5
Type:
Small organic molecule
Emp. Form.:
C20H14ClFN8O2
Mol. Mass.:
452.829
SMILES:
C[C@H](Nc1ncnc2occc12)c1nc2c(F)ccc(Cl)c2c(=O)n1-c1cnc(N)cn1
: