Target
Glutathione S-transferase P/Tyrosine-protein kinase SYK
Ligand
BDBM255579
Substrate
Meas. Tech.
Homogeneous Time-Resolved Fluorescence (HTRF) Assay
pH
7.5±n/a
Temperature
298.15±n/a K
IC50
2.684±n/a nM
Comments
extracted
Citation
 Arrington, KLDuBois, BDebenham, JSLiu, PNorthrup, ABSzewczyk, JWWang, LWang, M Thiazole-substituted aminopyrimidines as spleen tyrosine kinase inhibitors US Patent  US9499534 Publication Date 11/22/2016 
Target
Name:
Glutathione S-transferase P/Tyrosine-protein kinase SYK
Synonyms:
GST-Tyrosine-protein kinase SYK
Type:
Enzyme
Mol. Mass.:
Description:
Components:
This complex has 2 components.
Component 1
Name:
Glutathione S-transferase P
Synonyms:
FAEES3 GST3 GSTP1-1 Glutathione S-transferase Glutathione S-transferase P Glutathione transferase (GST)
Type:
Enzyme
Mol. Mass.:
23353.53
Organism:
Homo sapiens (Human)
Description:
P09211
Residue:
210
  
Component 2
Name:
Tyrosine-protein kinase SYK
Synonyms:
KSYK_HUMAN Spleen Tyrosine Kinase Tyrosine-protein kinase SYK (Syk)
Type:
Enzyme
Mol. Mass.:
72079.99
Organism:
Homo sapiens (Human)
Description:
P43405
Residue:
635
  
Inhibitor
Name:
BDBM255579
Synonyms:
US9499534, 2.26
Type:
Small organic molecule
Emp. Form.:
C27H29F3N4O3S
Mol. Mass.:
546.604
SMILES:
CC\C=C/c1cc(Nc2nccc(n2)C(F)(F)F)cc(c1)-c1cnc(s1)[C@@]1(O)CC[C@H](C(O)=O)C(C)(C)C1
: