Target
Phosphatidylinositol 4,5-bisphosphate 3-kinase catalytic subunit delta isoform
Ligand
BDBM255603
Substrate
Meas. Tech.
Enzymatic Inhibitory Activity Assay
pH
7.5±n/a
Temperature
298.15±n/a K
IC50
41±n/a nM
Comments
extracted
Citation
 Xu, Z Fused pyrimidine compound, and preparation method, intermediate, composition, and uses thereof US Patent  US9499561 Publication Date 11/22/2016 
Target
Name:
Phosphatidylinositol 4,5-bisphosphate 3-kinase catalytic subunit delta isoform
Synonyms:
PI3-kinase p110 subunit delta PI3-kinase subunit p110-delta PIK3CD Phosphatidylinositol 4,5-biphosphate 3-kinase catalytic subunit delta (PIK3CD) Phosphatidylinositol 4,5-bisphosphate 3-kinase 110 kDa catalytic subunit delta (PI3K delta) Phosphatidylinositol 4,5-bisphosphate 3-kinase catalytic subunit delta (PI3Kdelta) Phosphatidylinositol 4,5-bisphosphate 3-kinase catalytic subunit delta isoform (PI3K delta) Phosphatidylinositol 4,5-bisphosphate 3-kinase catalytic subunit delta isoform (PI3K-delta) Phosphatidylinositol 4,5-bisphosphate 3-kinase catalytic subunit delta isoform (PI3Kdelta)
Type:
Enzyme Subunit
Mol. Mass.:
119489.41
Organism:
Homo sapiens (Human)
Description:
O00329
Residue:
1044
  
Inhibitor
Name:
BDBM255603
Synonyms:
US9499561, 26
Type:
Small organic molecule
Emp. Form.:
C24H27N7O3S
Mol. Mass.:
493.581
SMILES:
OCC(=O)N1CCN(Cc2csc3c(nc(nc23)N2CCOCC2)-c2cccc3[nH]ncc23)CC1
: