Target
Fibroblast growth factor receptor 3 [397-806]/Glutathione S-transferase P
Ligand
BDBM255715
Substrate
Meas. Tech.
TR-FRET Based Assay
pH
7±n/a
Temperature
295.15±n/a K
IC50
35.9±n/a nM
Comments
extracted
Citation
 Lobell, MHübsch, WSchirok, HHéroult, MBrohm, DCollin, MGrünewald, SLustig, KBömer, UVoehringer, VLindner, N Substituted benzothienyl-pyrrolotriazines and uses thereof US Patent  US9475815 Publication Date 10/25/2016 
Target
Name:
Fibroblast growth factor receptor 3 [397-806]/Glutathione S-transferase P
Synonyms:
GST-Fibroblast growth factor receptor 3 (FGFR-3)
Type:
Protein
Mol. Mass.:
Description:
Components:
This complex has 2 components.
Component 1
Name:
Glutathione S-transferase P
Synonyms:
FAEES3 GST3 GSTP1-1 Glutathione S-transferase Glutathione S-transferase P Glutathione transferase (GST)
Type:
Enzyme
Mol. Mass.:
23353.53
Organism:
Homo sapiens (Human)
Description:
P09211
Residue:
210
  
Component 2
Name:
Fibroblast growth factor receptor 3 [397-806]
Synonyms:
FGFR3 Fibroblast growth factor receptor 3 (FGFR-3) JTK4
Type:
Enzyme Catalytic Domain
Mol. Mass.:
45431.04
Organism:
Homo sapiens (Human)
Description:
P22607[397-806]
Residue:
410
  
Inhibitor
Name:
BDBM255715
Synonyms:
US9475815, 100
Type:
Small organic molecule
Emp. Form.:
C23H26N6O2S
Mol. Mass.:
450.557
SMILES:
COc1cc(C)cc2cc(sc12)-c1cc(C(=O)N2CCC(C2)N(C)C)n2ncnc(N)c12
: