Target
Fibroblast growth factor receptor 3 [397-806]/Glutathione S-transferase P
Ligand
BDBM255729
Substrate
Meas. Tech.
TR-FRET Based Assay
pH
7±n/a
Temperature
295.15±n/a K
IC50
30.5±n/a nM
Comments
extracted
Citation
 Lobell, MHübsch, WSchirok, HHéroult, MBrohm, DCollin, MGrünewald, SLustig, KBömer, UVoehringer, VLindner, N Substituted benzothienyl-pyrrolotriazines and uses thereof US Patent  US9475815 Publication Date 10/25/2016 
Target
Name:
Fibroblast growth factor receptor 3 [397-806]/Glutathione S-transferase P
Synonyms:
GST-Fibroblast growth factor receptor 3 (FGFR-3)
Type:
Protein
Mol. Mass.:
Description:
Components:
This complex has 2 components.
Component 1
Name:
Glutathione S-transferase P
Synonyms:
FAEES3 GST3 GSTP1-1 Glutathione S-transferase Glutathione S-transferase P Glutathione transferase (GST)
Type:
Enzyme
Mol. Mass.:
23353.53
Organism:
Homo sapiens (Human)
Description:
P09211
Residue:
210
  
Component 2
Name:
Fibroblast growth factor receptor 3 [397-806]
Synonyms:
FGFR3 Fibroblast growth factor receptor 3 (FGFR-3) JTK4
Type:
Enzyme Catalytic Domain
Mol. Mass.:
45431.04
Organism:
Homo sapiens (Human)
Description:
P22607[397-806]
Residue:
410
  
Inhibitor
Name:
BDBM255729
Synonyms:
US9475815, 114
Type:
Small organic molecule
Emp. Form.:
C21H23N5O3S
Mol. Mass.:
425.504
SMILES:
CCNC(=O)COCc1cc(-c2cc3cc(C)cc(OC)c3s2)c2c(N)ncnn12
: