Target
Proto-oncogene tyrosine-protein kinase Src
Ligand
BDBM256508
Substrate
Meas. Tech.
Enzyme Inhibition Assay
IC50
11±n/a nM
Citation
 Baker, TMFyfe, MCHarbottle, GWHasimbegovic, VMeghani, PRigby, ASambrook-Smith, CThom, SM Kinase inhibitors US Patent  US9481648 Publication Date 11/1/2016 
Target
Name:
Proto-oncogene tyrosine-protein kinase Src
Synonyms:
Calmodulin/Proto-oncogene tyrosine-protein kinase Src Proto-oncogene c-Src SRC SRC_HUMAN V-src sarcoma (Schmidt-Ruppin A-2) viral oncogene homolog (avian) p60-Src | pp60c-src
Type:
Protein
Mol. Mass.:
59838.60
Organism:
Homo sapiens (Human)
Description:
P12931
Residue:
536
  
Inhibitor
Name:
BDBM256508
Synonyms:
US9481648, 6
Type:
Small organic molecule
Emp. Form.:
C41H48N8O8S
Mol. Mass.:
812.934
SMILES:
COc1cc(Nc2nccc(Oc3ccc(NC(=O)Nc4cc(cc(NS(C)(=O)=O)c4OC)C(C)(C)C)c4ccccc34)n2)cc(c1)C(=O)NCCN1CCOCC1
: