Target
Proto-oncogene tyrosine-protein kinase Src
Ligand
BDBM256521
Substrate
Meas. Tech.
Enzyme Inhibition Assay
IC50
6±n/a nM
Citation
 Baker, TMFyfe, MCHarbottle, GWHasimbegovic, VMeghani, PRigby, ASambrook-Smith, CThom, SM Kinase inhibitors US Patent  US9481648 Publication Date 11/1/2016 
Target
Name:
Proto-oncogene tyrosine-protein kinase Src
Synonyms:
Calmodulin/Proto-oncogene tyrosine-protein kinase Src Proto-oncogene c-Src SRC SRC_HUMAN V-src sarcoma (Schmidt-Ruppin A-2) viral oncogene homolog (avian) p60-Src | pp60c-src
Type:
Protein
Mol. Mass.:
59838.60
Organism:
Homo sapiens (Human)
Description:
P12931
Residue:
536
  
Inhibitor
Name:
BDBM256521
Synonyms:
US10435361, Example 20 US9790174, Example 20
Type:
Small organic molecule
Emp. Form.:
C41H48N6O9
Mol. Mass.:
768.8546
SMILES:
COCCOCCOCCOc1cc(Nc2nccc(Oc3ccc(NC(=O)Nc4cc(cc(C(N)=O)c4OC)C(C)(C)C)c4ccccc34)n2)cc(OC)c1
: