Target
Tyrosine-protein kinase SYK
Ligand
BDBM256521
Substrate
Meas. Tech.
Enzyme Inhibition Assay
IC50
29±n/a nM
Citation
 Baker, TMFyfe, MCHarbottle, GWHasimbegovic, VMeghani, PRigby, ASambrook-Smith, CThom, SM Kinase inhibitors US Patent  US9481648 Publication Date 11/1/2016 
Target
Name:
Tyrosine-protein kinase SYK
Synonyms:
KSYK_HUMAN Spleen Tyrosine Kinase Tyrosine-protein kinase SYK (Syk)
Type:
Enzyme
Mol. Mass.:
72079.99
Organism:
Homo sapiens (Human)
Description:
P43405
Residue:
635
  
Inhibitor
Name:
BDBM256521
Synonyms:
US10435361, Example 20 US9790174, Example 20
Type:
Small organic molecule
Emp. Form.:
C41H48N6O9
Mol. Mass.:
768.8546
SMILES:
COCCOCCOCCOc1cc(Nc2nccc(Oc3ccc(NC(=O)Nc4cc(cc(C(N)=O)c4OC)C(C)(C)C)c4ccccc34)n2)cc(OC)c1
: