Target
chymase
Ligand
BDBM255943
Substrate
Meas. Tech.
Enzymatic Chymase Assay
pH
7.5±n/a
IC50
3±n/a nM
Comments
extracted
Citation
 Fürstner, CAckerstaff, JStraub, AMeier, HTinel, HZimmermann, KTersteegen, AZubov, DKast, RSchamberger, JSchäfer, MBörngen, K Bicyclically substituted uracils and the use thereof US Patent  US9481672 Publication Date 11/1/2016 
Target
Name:
chymase
Synonyms:
Type:
Enzyme
Mol. Mass.:
27507.42
Organism:
Mesocricetus auratus (Golden hamster)
Description:
A0A1U7QTH6
Residue:
247
  
Inhibitor
Name:
BDBM255943
Synonyms:
US9481672, 121
Type:
Small organic molecule
Emp. Form.:
C23H19F3N4O5
Mol. Mass.:
488.416
SMILES:
Cc1c(Cn2c(=O)c(cn(-c3ccc4n(C)c(=O)n(C)c4c3)c2=O)C(O)=O)cccc1C(F)(F)F
: