Target
Matrix metalloproteinase-9
Ligand
BDBM256138
Substrate
Meas. Tech.
Activity Assay
pH
7.5±n/a
Temperature
310.15±n/a K
IC50
>500000±n/a nM
Comments
extracted
Citation
 Ferdinandy, PCsont, TBCsonka, CKedvesné Kupai, KKovács, LKis-Tamás, ATakács, FTKónya, DMedgyes, GCseh, SHajdú, ILörincz, ZDormán, GGörbe, A Inhibitors of matrix metalloproteinases US Patent  US9487462 Publication Date 11/8/2016 
Target
Name:
Matrix metalloproteinase-9
Synonyms:
67 kDa matrix metalloproteinase-9 92 kDa gelatinase CLG4B Gelatinase B MMP9 Matrix metalloproteinase 9 (MMP-9) Matrix metalloproteinase-9 (MMP9)
Type:
Enzyme
Mol. Mass.:
78452.28
Organism:
Homo sapiens (Human)
Description:
P14780
Residue:
707
  
Inhibitor
Name:
BDBM256138
Synonyms:
US9487462, 20
Type:
Small organic molecule
Emp. Form.:
C27H27N3O3S
Mol. Mass.:
473.587
SMILES:
CCOC(=O)c1csc(CN(Cc2ccncc2)Cc2ccc(OCc3ccccc3)cc2)n1
: