Target
Interstitial collagenase
Ligand
BDBM256128
Substrate
Meas. Tech.
Activity Assay
pH
7.5±n/a
Temperature
310.15±n/a K
IC50
>500000±n/a nM
Comments
extracted
Citation
 Ferdinandy, PCsont, TBCsonka, CKedvesné Kupai, KKovács, LKis-Tamás, ATakács, FTKónya, DMedgyes, GCseh, SHajdú, ILörincz, ZDormán, GGörbe, A Inhibitors of matrix metalloproteinases US Patent  US9487462 Publication Date 11/8/2016 
Target
Name:
Interstitial collagenase
Synonyms:
CLG MMP1 Matrix metalloproteinase-1 | Matrix metalloproteinase-1 (MMP-1)
Type:
Enzyme
Mol. Mass.:
54010.26
Organism:
Homo sapiens (Human)
Description:
P03956
Residue:
469
  
Inhibitor
Name:
BDBM256128
Synonyms:
US9487462, 10
Type:
Small organic molecule
Emp. Form.:
C24H22N4O3S
Mol. Mass.:
446.521
SMILES:
OC(=O)c1csc(CN(Cc2ccc(OCc3cccnc3)cc2)Cc2cccnc2)n1
: