Target
Complement factor D
Ligand
BDBM256189
Substrate
Meas. Tech.
Human Complement Factor D Assay
pH
7.5±n/a
Temperature
298.15±n/a K
IC50
114±n/a nM
Comments
extracted
Citation
 Altmann, EHommel, ULorthiois, ELMaibaum, JKOstermann, NQuancard, JRandl, SARogel, OVulpetti, AFlohr, S Complement pathway modulators and uses thereof US Patent  US9487483 Publication Date 11/8/2016 
Target
Name:
Complement factor D
Synonyms:
Adipsin CFAD_HUMAN DF Properdin factor D
Type:
Protein
Mol. Mass.:
27039.19
Organism:
Homo sapiens (Human)
Description:
P00746
Residue:
253
  
Inhibitor
Name:
BDBM256189
Synonyms:
US9487483, 41
Type:
Small organic molecule
Emp. Form.:
C22H25F3N6O3
Mol. Mass.:
478.4675
SMILES:
NC(=O)c1nn(CC(=O)N2[C@@H]3C[C@@H]3C[C@H]2C(=O)N[C@@H]2CCC[C@@H](C2)C(F)(F)F)c2cnccc12
: