Target
Complement factor D
Ligand
BDBM256253
Substrate
Meas. Tech.
Human Complement Factor D Assay
pH
7.5±n/a
Temperature
298.15±n/a K
IC50
225±n/a nM
Comments
extracted
Citation
 Altmann, EHommel, ULorthiois, ELMaibaum, JKOstermann, NQuancard, JRandl, SARogel, OVulpetti, AFlohr, S Complement pathway modulators and uses thereof US Patent  US9487483 Publication Date 11/8/2016 
Target
Name:
Complement factor D
Synonyms:
Adipsin CFAD_HUMAN DF Properdin factor D
Type:
Protein
Mol. Mass.:
27039.19
Organism:
Homo sapiens (Human)
Description:
P00746
Residue:
253
  
Inhibitor
Name:
BDBM256253
Synonyms:
US9487483, 105
Type:
Small organic molecule
Emp. Form.:
C25H33N5O4
Mol. Mass.:
467.5606
SMILES:
CO[C@@H]1C[C@H](CC(C)(C)C1)NC(=O)[C@@H]1C[C@H]2C[C@H]2N1C(=O)Cn1nc(C(N)=O)c2ccccc12
: