Target
Transient receptor potential cation channel subfamily M member 8
Ligand
BDBM256284
Substrate
Meas. Tech.
Inhibition Assay
Temperature
310.15±n/a K
IC50
2.3±n/a nM
Comments
extracted
Citation
 Kato, TSakamoto, TKubo, ASawamoto, D Sulfonamide compound US Patent  US9487488 Publication Date 11/8/2016 
Target
Name:
Transient receptor potential cation channel subfamily M member 8
Synonyms:
LTRPC6 TRPM8_HUMAN Transient receptor potential M8 protein (TRPM8) Transient receptor potential cation channel subfamily M member 8 (TRPM8)
Type:
Enzyme
Mol. Mass.:
127693.26
Organism:
Homo sapiens (Human)
Description:
Q7Z2W7
Residue:
1104
  
Inhibitor
Name:
BDBM256284
Synonyms:
US9487488, 8
Type:
Small organic molecule
Emp. Form.:
C26H16F6N4O5S
Mol. Mass.:
610.484
SMILES:
FC(F)(F)Oc1ccc(CN(c2ncc3ccccc3c2C(F)(F)F)S(=O)(=O)c2ccc(cc2)-c2noc(=O)[nH]2)cc1
: