Target
Isoform 2 of Nuclear receptor ROR-gamma (RORgT)
Ligand
BDBM256348
Substrate
Meas. Tech.
TR-FRET Assay
pH
7±n/a
Temperature
277.15±n/a K
IC50
123±n/a nM
Comments
extracted
Citation
 Barr, KJMaclean, JKZhang, HBeresis, RTZhang, DAndresen, BMAnthony, NJLapointe, BTSciammetta, N 3-cyclohexenyl and cyclohexyl substituted indole and indazole compounds as RORgammaT inhibitors and uses thereof US Patent  US9487490 Publication Date 11/8/2016 
Target
Name:
Isoform 2 of Nuclear receptor ROR-gamma (RORgT)
Synonyms:
Isoform 2 of Nuclear receptor ROR-gamma Nuclear receptor ROR-gamma (RORgT) RORC RORG_HUMAN Retinoid-related orphan receptor-gamma (RORgT) | Retinoid-related orphan receptor-gamma (RORĪ³T)
Type:
Protein
Mol. Mass.:
55831.73
Organism:
Homo sapiens (Human)
Description:
P51449-2
Residue:
497
  
Inhibitor
Name:
BDBM256348
Synonyms:
US9487490, 1L
Type:
Small organic molecule
Emp. Form.:
C21H18ClN3O3
Mol. Mass.:
395.839
SMILES:
Cc1cccc(Cl)c1C(=O)n1nc(C2=CCC(CC2)C(O)=O)c2ncccc12
: