Target
Isoform 2 of Nuclear receptor ROR-gamma (RORgT)
Ligand
BDBM256379
Substrate
Meas. Tech.
TR-FRET Assay
pH
7±n/a
Temperature
277.15±n/a K
IC50
7±n/a nM
Comments
extracted
Citation
 Barr, KJMaclean, JKZhang, HBeresis, RTZhang, DAndresen, BMAnthony, NJLapointe, BTSciammetta, N 3-cyclohexenyl and cyclohexyl substituted indole and indazole compounds as RORgammaT inhibitors and uses thereof US Patent  US9487490 Publication Date 11/8/2016 
Target
Name:
Isoform 2 of Nuclear receptor ROR-gamma (RORgT)
Synonyms:
Isoform 2 of Nuclear receptor ROR-gamma Nuclear receptor ROR-gamma (RORgT) RORC RORG_HUMAN Retinoid-related orphan receptor-gamma (RORgT) | Retinoid-related orphan receptor-gamma (RORĪ³T)
Type:
Protein
Mol. Mass.:
55831.73
Organism:
Homo sapiens (Human)
Description:
P51449-2
Residue:
497
  
Inhibitor
Name:
BDBM256379
Synonyms:
US9487490, 4AA
Type:
Small organic molecule
Emp. Form.:
C28H25ClF3N3O5
Mol. Mass.:
575.963
SMILES:
CO[C@H]1CCN(C1)C(=O)c1ccc2c(nn(C(=O)c3c(Cl)cccc3C(F)(F)F)c2c1)C1=CCC(CC1)C(O)=O
: