Target
Trace amine-associated receptor 1
Ligand
BDBM256409
Substrate
Meas. Tech.
Radioligand Binding Assay
pH
7.4±n/a
Temperature
310.15±n/a K
Ki
1.2±n/a nM
Comments
extracted
Citation
 Galley, GNorcross, RPflieger, P Pyrazole carboxamide compounds and uses thereof US Patent  US9487501 Publication Date 11/8/2016 
Target
Name:
Trace amine-associated receptor 1
Synonyms:
TAAR1_MOUSE Taar1 Trace amine receptor 1 (TARR1) Trace amine-associated receptor1 | Trar1
Type:
Protein
Mol. Mass.:
37635.41
Organism:
Mus musculus (Mouse)
Description:
Q923Y8
Residue:
332
  
Inhibitor
Name:
BDBM256409
Synonyms:
US9487501, 10
Type:
Small organic molecule
Emp. Form.:
C19H18IN5O2
Mol. Mass.:
475.283
SMILES:
Ic1ccc(nc1)-n1cc(cn1)C(=O)Nc1ccc(cc1)[C@H]1CNCCO1
: