Target
Trace amine-associated receptor 1
Ligand
BDBM256431
Substrate
Meas. Tech.
Radioligand Binding Assay
pH
7.4±n/a
Temperature
310.15±n/a K
Ki
0.8±n/a nM
Comments
extracted
Citation
 Galley, GNorcross, RPflieger, P Pyrazole carboxamide compounds and uses thereof US Patent  US9487501 Publication Date 11/8/2016 
Target
Name:
Trace amine-associated receptor 1
Synonyms:
TAAR1_MOUSE Taar1 Trace amine receptor 1 (TARR1) Trace amine-associated receptor1 | Trar1
Type:
Protein
Mol. Mass.:
37635.41
Organism:
Mus musculus (Mouse)
Description:
Q923Y8
Residue:
332
  
Inhibitor
Name:
BDBM256431
Synonyms:
US9487501, 32
Type:
Small organic molecule
Emp. Form.:
C22H22F2N4O3
Mol. Mass.:
428.4319
SMILES:
Cc1nn(cc1C(=O)Nc1ccc(cc1)[C@H]1CNCCO1)-c1ccc(OC(F)F)cc1
: