Target
Trace amine-associated receptor 1
Ligand
BDBM256435
Substrate
Meas. Tech.
Radioligand Binding Assay
pH
7.4±n/a
Temperature
310.15±n/a K
Ki
5.4±n/a nM
Comments
extracted
Citation
 Galley, GNorcross, RPflieger, P Pyrazole carboxamide compounds and uses thereof US Patent  US9487501 Publication Date 11/8/2016 
Target
Name:
Trace amine-associated receptor 1
Synonyms:
TAAR1_RAT Taar1 Trace amine receptor 1 (TARR1) Trace amine-associated receptor 1 (TAAR1) Trar1
Type:
Enzyme
Mol. Mass.:
38034.73
Organism:
Rattus norvegicus (Rat)
Description:
Q923Y9
Residue:
332
  
Inhibitor
Name:
BDBM256435
Synonyms:
US9487501, 36
Type:
Small organic molecule
Emp. Form.:
C18H17ClN6O2
Mol. Mass.:
384.82
SMILES:
Clc1nccc(n1)-n1cc(cn1)C(=O)Nc1ccc(cc1)[C@H]1CNCCO1
: