Target
Trace amine-associated receptor 1
Ligand
BDBM256436
Substrate
Meas. Tech.
Radioligand Binding Assay
pH
7.4±n/a
Temperature
310.15±n/a K
Ki
93.1±n/a nM
Comments
extracted
Citation
 Galley, GNorcross, RPflieger, P Pyrazole carboxamide compounds and uses thereof US Patent  US9487501 Publication Date 11/8/2016 
Target
Name:
Trace amine-associated receptor 1
Synonyms:
TAAR1_RAT Taar1 Trace amine receptor 1 (TARR1) Trace amine-associated receptor 1 (TAAR1) Trar1
Type:
Enzyme
Mol. Mass.:
38034.73
Organism:
Rattus norvegicus (Rat)
Description:
Q923Y9
Residue:
332
  
Inhibitor
Name:
BDBM256436
Synonyms:
US9487501, 37
Type:
Small organic molecule
Emp. Form.:
C19H17F3N6O2
Mol. Mass.:
418.3725
SMILES:
FC(F)(F)c1cnc(nc1)-n1cc(cn1)C(=O)Nc1ccc(cc1)[C@H]1CNCCO1
: