Target
Trace amine-associated receptor 1
Ligand
BDBM256441
Substrate
Meas. Tech.
Radioligand Binding Assay
pH
7.4±n/a
Temperature
310.15±n/a K
Ki
32.6±n/a nM
Comments
extracted
Citation
 Galley, GNorcross, RPflieger, P Pyrazole carboxamide compounds and uses thereof US Patent  US9487501 Publication Date 11/8/2016 
Target
Name:
Trace amine-associated receptor 1
Synonyms:
TAAR1_RAT Taar1 Trace amine receptor 1 (TARR1) Trace amine-associated receptor 1 (TAAR1) Trar1
Type:
Enzyme
Mol. Mass.:
38034.73
Organism:
Rattus norvegicus (Rat)
Description:
Q923Y9
Residue:
332
  
Inhibitor
Name:
BDBM256441
Synonyms:
US9487501, 42
Type:
Small organic molecule
Emp. Form.:
C19H17N7O2
Mol. Mass.:
375.384
SMILES:
O=C(Nc1ccc(cc1)[C@H]1CNCCO1)c1cnn(c1)-c1cnc(cn1)C#N
: