Target
Amine oxidase [flavin-containing] A
Ligand
BDBM256469
Substrate
Meas. Tech.
Biological Assay
pH
7.5±n/a
Temperature
310.15±n/a K
IC50
>100000±n/a nM
Comments
extracted
Citation
 Ortega Muñoz, AFyfe, MCMartinell Pedemonte, MEstiarte Martinez, MValls Vidal, NKurz, GCastro Palomino Laria, JC (Hetero)aryl cyclopropylamine compounds as LSD1 inhibitors US Patent  US9487512 Publication Date 11/8/2016 
Target
Name:
Amine oxidase [flavin-containing] A
Synonyms:
AOFA_HUMAN MAO-A Monoamine oxidase Monoamine oxidase type A (MAO A) Monoamine oxidase type A (MAOA)
Type:
Protein
Mol. Mass.:
59689.53
Organism:
Homo sapiens (Human)
Description:
P21397
Residue:
527
  
Inhibitor
Name:
BDBM256469
Synonyms:
US10329256, Example 14 US9944601, Example 14
Type:
Small organic molecule
Emp. Form.:
C19H28N2
Mol. Mass.:
284.439
SMILES:
C1[C@H](NC2CCC3(CCNCC3)CC2)[C@H]1c1ccccc1
: