Target
Amine oxidase [flavin-containing] A
Ligand
BDBM256499
Substrate
Meas. Tech.
Biological Assay
pH
7.5±n/a
Temperature
310.15±n/a K
IC50
100000±n/a nM
Comments
extracted
Citation
 Ortega Muñoz, AFyfe, MCMartinell Pedemonte, MEstiarte Martinez, MValls Vidal, NKurz, GCastro Palomino Laria, JC (Hetero)aryl cyclopropylamine compounds as LSD1 inhibitors US Patent  US9487512 Publication Date 11/8/2016 
Target
Name:
Amine oxidase [flavin-containing] A
Synonyms:
AOFA_HUMAN MAO-A Monoamine oxidase Monoamine oxidase type A (MAO A) Monoamine oxidase type A (MAOA)
Type:
Protein
Mol. Mass.:
59689.53
Organism:
Homo sapiens (Human)
Description:
P21397
Residue:
527
  
Inhibitor
Name:
BDBM256499
Synonyms:
US10329256, Example 44 US9944601, Example 44
Type:
Small organic molecule
Emp. Form.:
C18H24N4
Mol. Mass.:
296.41
SMILES:
C(N[C@H]1C[C@@H]1c1ccc(cc1)-c1ccn[nH]1)C1CCNCC1
: