Target
Glutathione S-transferase P/Isoform 2 of Lysine-specific histone demethylase 1A (2) [158-876]
Ligand
BDBM256460
Substrate
Meas. Tech.
Biological Assay
pH
7.4±n/a
Temperature
310.15±n/a K
IC50
19±n/a nM
Comments
extracted
Citation
 Ortega Muñoz, AFyfe, MCMartinell Pedemonte, MEstiarte Martinez, MValls Vidal, NKurz, GCastro Palomino Laria, JC (Hetero)aryl cyclopropylamine compounds as LSD1 inhibitors US Patent  US9487512 Publication Date 11/8/2016 
Target
Name:
Glutathione S-transferase P/Isoform 2 of Lysine-specific histone demethylase 1A (2) [158-876]
Synonyms:
GST-Lysine-specific histone demethylase 1A (LSD1) | Glutathione S-transferase P/Lysine-specific histone demethylase 1A (2) [158-876]
Type:
Enzyme
Mol. Mass.:
Description:
Components:
This complex has 2 components.
Component 1
Name:
Glutathione S-transferase P
Synonyms:
FAEES3 GST3 GSTP1-1 Glutathione S-transferase Glutathione S-transferase P Glutathione transferase (GST)
Type:
Enzyme
Mol. Mass.:
23353.53
Organism:
Homo sapiens (Human)
Description:
P09211
Residue:
210
  
Component 2
Name:
Isoform 2 of Lysine-specific histone demethylase 1A (2) [158-876]
Synonyms:
AOF2 KDM1A KIAA0601 Lysine-specific histone demethylase 1A (2) [158-876] | Lysine-specific histone demethylase 1A (LSD1)
Type:
Mol. Mass.:
79390.01
Organism:
Homo sapiens (Human)
Description:
amino acids 158-end; GenBank accession no. NM_015013, uniprot: O60341-2 from NM_015013
Residue:
719
  
Inhibitor
Name:
BDBM256460
Synonyms:
US9487512, 4
Type:
Small organic molecule
Emp. Form.:
C21H26N2O
Mol. Mass.:
322.4439
SMILES:
C(Oc1ccc(cc1)[C@@H]1C[C@H]1NC1CCNCC1)c1ccccc1
: