Target
Glutathione S-transferase P/Lysine-specific histone demethylase 1A [172-833]
Ligand
BDBM256652
Substrate
Meas. Tech.
Inhibitory Activity Assay
pH
8±n/a
Temperature
298.15±n/a K
IC50
<100±n/a nM
Comments
extracted
Citation
 Matsumoto, SHattori, YToyofuku, MMorimoto, SDaini, MKojima, TKaku, TIto, M Cyclopropanamine compound and use thereof US Patent  US9487511 Publication Date 11/8/2016 
Target
Name:
Glutathione S-transferase P/Lysine-specific histone demethylase 1A [172-833]
Synonyms:
GST-Lysine-specific histone demethylase 1A (LSD1)
Type:
Enzyme
Mol. Mass.:
Description:
Components:
This complex has 2 components.
Component 1
Name:
Glutathione S-transferase P
Synonyms:
FAEES3 GST3 GSTP1-1 Glutathione S-transferase Glutathione S-transferase P Glutathione transferase (GST)
Type:
Enzyme
Mol. Mass.:
23353.53
Organism:
Homo sapiens (Human)
Description:
P09211
Residue:
210
  
Component 2
Name:
Lysine-specific histone demethylase 1A [172-833]
Synonyms:
AOF2 KDM1A KIAA0601 Lysine-specific histone demethylase 1A (LSD1)
Type:
Enzyme
Mol. Mass.:
73571.08
Organism:
Homo sapiens (Human)
Description:
aa 172-833
Residue:
662
  
Inhibitor
Name:
BDBM256652
Synonyms:
US10053456, 31 US10968213, Example 31 US9718814, 31 | US9920047, 31
Type:
Small organic molecule
Emp. Form.:
C19H26F2N2O2S
Mol. Mass.:
384.484
SMILES:
FC1(F)CCC(CC1)NC(=O)c1csc(c1)C1CC1NC1CCOCC1
: