Target
Beta-secretase 2
Ligand
BDBM256770
Substrate
Meas. Tech.
Time-Resolved Endpoint proteolysis Assay
pH
5±n/a
Temperature
303.15±n/a K
Ki
6±n/a nM
Comments
extracted
Citation
 Cumming, JNKaelin, Jr., DEScott, JDStamford, AWIserloh, U C6-azaspiro iminothiadiazine dioxides as bace inhibitors, compositions, and their use US Patent  US9489013 Publication Date 11/8/2016 
Target
Name:
Beta-secretase 2
Synonyms:
AEPLC ASP1 Asp 1 Aspartyl protease 1 BACE2_HUMAN Beta-secretase (BACE) Beta-secretase 2 (BACE-2) Beta-site APP-cleaving enzyme 2 Memapsin-1 beta-Secretase (BACE-2)
Type:
Protein
Mol. Mass.:
56171.20
Organism:
Homo sapiens (Human)
Description:
Q9Y5Z0
Residue:
518
  
Inhibitor
Name:
BDBM256770
Synonyms:
US9489013, 41
Type:
Small organic molecule
Emp. Form.:
C26H27F2N7O3S
Mol. Mass.:
555.599
SMILES:
CN1C(=N)N[C@](C)(c2cc(NC(=O)c3ccc(F)cn3)ccc2F)[C@]2(CCN(Cc3ccccn3)C2)S1(=O)=O
: