Target
RAC-alpha serine/threonine-protein kinase
Ligand
BDBM256849
Substrate
Meas. Tech.
In Vitro AKT1 Kinase Assay
pH
7.5±n/a
Temperature
298.15±n/a K
IC50
12±n/a nM
Comments
extracted
Citation
 Johnson, PDLeach, ALuke, RWMatusiak, ZSMorris, JJ Protein kinase B inhibitors US Patent  US9492453 Publication Date 11/15/2016 
Target
Name:
RAC-alpha serine/threonine-protein kinase
Synonyms:
AKT phosphorylation (p-AKT) AKT1/PPP1CA C-AKT PKB alpha Protein kinase B Protein kinase B (Akt 1) Protein kinase B alpha Proto-oncogene Akt (Akt1) Proto-oncogene c-Akt (AKT1) RAC-PK-alpha RAC-alpha serine/threonine-protein kinase (AKT1) | RAC-alpha serine/threonine-protein kinase (pAKT)
Type:
Enzyme
Mol. Mass.:
55681.25
Organism:
Homo sapiens (Human)
Description:
P31749
Residue:
480
  
Inhibitor
Name:
BDBM256849
Synonyms:
US10654855, Example 32 US9492453, 32
Type:
Small organic molecule
Emp. Form.:
C20H22Cl2N6O
Mol. Mass.:
433.334
SMILES:
C[C@H](NC(=O)C1(N)CCN(CC1)c1ncnc2[nH]cc(Cl)c12)c1ccc(Cl)cc1
: