Target
Glutathione S-transferase P/Serine/threonine-protein kinase/endoribonuclease IRE1
Ligand
BDBM257042
Substrate
Meas. Tech.
Inhibition Assay
pH
7.5±n/a
Temperature
303.15±n/a K
IC50
<100±n/a nM
Comments
extracted
Citation
 Zeng, QWade, WSPatterson, JB IRE-1α inhibitors US Patent  US9493435 Publication Date 11/15/2016 
Target
Name:
Glutathione S-transferase P/Serine/threonine-protein kinase/endoribonuclease IRE1
Synonyms:
GST-Inositol requiring enzyme 1 (IRE-1alpha)
Type:
Enzyme
Mol. Mass.:
Description:
Components:
This complex has 2 components.
Component 1
Name:
Glutathione S-transferase P
Synonyms:
FAEES3 GST3 GSTP1-1 Glutathione S-transferase Glutathione S-transferase P Glutathione transferase (GST)
Type:
Enzyme
Mol. Mass.:
23353.53
Organism:
Homo sapiens (Human)
Description:
P09211
Residue:
210
  
Component 2
Name:
Serine/threonine-protein kinase/endoribonuclease IRE1
Synonyms:
ERN1 Endoplasmic reticulum-to-nucleus signaling 1 IRE1 Inositol requiring enzyme 1 (IRE-1alpha) Inositol-requiring protein 1 Ire1-alpha Serine/threonine-protein kinase/endoribonuclease IRE1 hIRE1p
Type:
Enzyme
Mol. Mass.:
109731.20
Organism:
Homo sapiens (Human)
Description:
O75460
Residue:
977
  
Inhibitor
Name:
BDBM257042
Synonyms:
US9493435, 60
Type:
Small organic molecule
Emp. Form.:
C20H19N3O3S
Mol. Mass.:
381.448
SMILES:
CN1CCN(CC1)C(=O)c1csc(n1)-c1ccc2c(C=O)c(O)ccc2c1
: