Target
Orexin receptor type 2
Ligand
BDBM258029
Substrate
Meas. Tech.
In Vitro Assay
Temperature
310.15±n/a K
IC50
2±n/a nM
Comments
extracted
Citation
 Bolli, MBoss, CBrotschi, CGude, MHeidmann, BSifferlen, TWilliams, JT Orexin receptor antagonists which are [ortho bi-(hetero-)aryl]-[2-(meta bi-(hetero-)aryl)-pyrrolidin-1-yl]-methanone derivatives US Patent  US9493446 Publication Date 11/15/2016 
Target
Name:
Orexin receptor type 2
Synonyms:
HCRTR2 OX2R_HUMAN Orexin receptor type 2 (OR-2) Orexin receptor type 2 (OX2R) Ox-2-R | Ox2-R
Type:
Protein
Mol. Mass.:
50710.53
Organism:
Homo sapiens (Human)
Description:
O43614
Residue:
444
  
Inhibitor
Name:
BDBM258029
Synonyms:
US9493446, 498
Type:
Small organic molecule
Emp. Form.:
C24H22F3N7O2
Mol. Mass.:
497.4724
SMILES:
Cc1cc(C(=O)N2CCC[C@H]2c2nnc([nH]2)-c2ccccc2OC(F)(F)F)c(cc1C)-n1nccn1
: