Target
Phosphatidylinositol 4,5-bisphosphate 3-kinase catalytic subunit gamma isoform
Ligand
BDBM281493
Substrate
Meas. Tech.
Scintillation Proximity Assay (PI3K-γ)
pH
6.7±n/a
Temperature
298.15±n/a K
IC50
<250±n/a nM
Comments
extracted
Citation
 Zou, GCombs, APBuesking, AW Aza-heteroaryl compounds as PI3K-gamma inhibitors US Patent  US9586949 Publication Date 3/7/2017 
Target
Name:
Phosphatidylinositol 4,5-bisphosphate 3-kinase catalytic subunit gamma isoform
Synonyms:
PI3-kinase p110 subunit gamma PI3Kgamma PK3CG_HUMAN Phosphatidylinositol 4,5-bisphosphate 3-kinase (PI3K) Phosphatidylinositol 4,5-bisphosphate 3-kinase catalytic subunit gamma (PI3Kgamma) Phosphatidylinositol 4,5-bisphosphate 3-kinase catalytic subunit gamma isoform (PI3K) Phosphatidylinositol-4,5-bisphosphate 3-kinase catalytic subunit gamma isoform Phosphoinositide 3-kinases gamma (PI3K gamma) p120-PI3K
Type:
Enzyme Subunit
Mol. Mass.:
126470.30
Organism:
Homo sapiens (Human)
Description:
P48736
Residue:
1102
  
Inhibitor
Name:
BDBM281493
Synonyms:
N-(5-(2-(1H- Benzo[d]imidazol- 2- yl)benzo[d]oxazol- 6-yl)pyridin-3-yl)- 3- fluorobenzene- sulfonamide US10596184, Example 19 | US9586949, Example 19
Type:
Small organic molecule
Emp. Form.:
C25H16FN5O3S
Mol. Mass.:
485.49
SMILES:
Fc1cccc(c1)S(=O)(=O)Nc1cncc(c1)-c1ccc2nc(oc2c1)-c1nc2ccccc2[nH]1
: