Target
Sodium channel protein type 9 subunit alpha
Ligand
BDBM258099
Substrate
Meas. Tech.
Electrophysiological Assay
pH
7.3±n/a
Temperature
310.15±n/a K
IC50
>10000±n/a nM
Comments
extracted
Citation
 Shinozuka, TKobayashi, HSuzuki, STanaka, KKimoto, HDomon, Y Cycloalkane derivatives US Patent  US9493448 Publication Date 11/15/2016 
Target
Name:
Sodium channel protein type 9 subunit alpha
Synonyms:
NENA Peripheral sodium channel 1 SCN9A_HUMAN Voltage-gated sodium channel subunit Nav1.7 hNE-Na
Type:
Protein
Mol. Mass.:
226375.97
Organism:
Homo sapiens (Human)
Description:
Q15858
Residue:
1988
  
Inhibitor
Name:
BDBM258099
Synonyms:
US9493448, 1 US9493448, 3 US9845313, Example 2
Type:
Small organic molecule
Emp. Form.:
C20H19F2N3O3S2
Mol. Mass.:
451.51
SMILES:
Fc1cc(c(F)cc1O[C@H]1CCCC[C@@H]1c1ccccc1)S(=O)(=O)Nc1ncns1
: