Target
Sodium channel protein type 9 subunit alpha
Ligand
BDBM258191
Substrate
Meas. Tech.
Electrophysiological Assay
pH
7.3±n/a
Temperature
310.15±n/a K
IC50
34±n/a nM
Comments
extracted
Citation
 Shinozuka, TKobayashi, HSuzuki, STanaka, KKimoto, HDomon, Y Cycloalkane derivatives US Patent  US9493448 Publication Date 11/15/2016 
Target
Name:
Sodium channel protein type 9 subunit alpha
Synonyms:
NENA Peripheral sodium channel 1 SCN9A_HUMAN Voltage-gated sodium channel subunit Nav1.7 hNE-Na
Type:
Protein
Mol. Mass.:
226375.97
Organism:
Homo sapiens (Human)
Description:
Q15858
Residue:
1988
  
Inhibitor
Name:
BDBM258191
Synonyms:
US9493448, 97 | US9845313, Example 97
Type:
Small organic molecule
Emp. Form.:
C26H25F2N5O4S
Mol. Mass.:
541.57
SMILES:
Cn1nccc1[C@H]1C[C@H](C[C@@H]1Oc1cc(F)c(cc1F)S(=O)(=O)Nc1ccncn1)OCc1ccccc1
: