Target
Sodium channel protein type 9 subunit alpha
Ligand
BDBM258202
Substrate
Meas. Tech.
Electrophysiological Assay
pH
7.3±n/a
Temperature
310.15±n/a K
IC50
1700±n/a nM
Comments
extracted
Citation
 Shinozuka, TKobayashi, HSuzuki, STanaka, KKimoto, HDomon, Y Cycloalkane derivatives US Patent  US9493448 Publication Date 11/15/2016 
Target
Name:
Sodium channel protein type 9 subunit alpha
Synonyms:
NENA Peripheral sodium channel 1 SCN9A_HUMAN Voltage-gated sodium channel subunit Nav1.7 hNE-Na
Type:
Protein
Mol. Mass.:
226375.97
Organism:
Homo sapiens (Human)
Description:
Q15858
Residue:
1988
  
Inhibitor
Name:
BDBM258202
Synonyms:
US9493448, 108 | US9845313, Example 108
Type:
Small organic molecule
Emp. Form.:
C19H20FN5O3S
Mol. Mass.:
417.457
SMILES:
Fc1cc(O[C@H]2CCCC[C@@H]2c2cn[nH]c2)ccc1S(=O)(=O)Nc1ccncn1
: