Target
Sodium channel protein type 9 subunit alpha
Ligand
BDBM258215
Substrate
Meas. Tech.
Electrophysiological Assay
pH
7.3±n/a
Temperature
310.15±n/a K
IC50
930±n/a nM
Comments
extracted
Citation
 Shinozuka, TKobayashi, HSuzuki, STanaka, KKimoto, HDomon, Y Cycloalkane derivatives US Patent  US9493448 Publication Date 11/15/2016 
Target
Name:
Sodium channel protein type 9 subunit alpha
Synonyms:
NENA Peripheral sodium channel 1 SCN9A_HUMAN Voltage-gated sodium channel subunit Nav1.7 hNE-Na
Type:
Protein
Mol. Mass.:
226375.97
Organism:
Homo sapiens (Human)
Description:
Q15858
Residue:
1988
  
Inhibitor
Name:
BDBM258215
Synonyms:
US9493448, 121 | US9845313, Example 121
Type:
Small organic molecule
Emp. Form.:
C20H21F2N5O4S
Mol. Mass.:
465.474
SMILES:
CO[C@H]1C[C@H](Oc2cc(F)c(cc2F)S(=O)(=O)Nc2ccncn2)[C@H](C1)c1ccnn1C
: