Target
Beta-secretase 1
Ligand
BDBM258274
Substrate
Meas. Tech.
AlphaScreen Assay
pH
7±n/a
IC50
26±n/a nM
Comments
extracted
Citation
 Xu, YArtis, DRBowers, SHom, RKSham, HLYuan, S Spirocyclic dihydro-thiazine and dihydro-oxazine BACE inhibitors, and compositions and uses thereof US Patent  US9493485 Publication Date 11/15/2016 
Target
Name:
Beta-secretase 1
Synonyms:
ASP2 Aspartyl protease 2 BACE1 Beta-secretase (BACE) Beta-secretase 1 (BACE 1) Beta-secretase 1 (BACE1) Beta-site amyloid precursor protein cleaving enzyme 1 Memapsin-2 beta-Secretase (BACE-1) | beta-Secretase (BACE1)
Type:
Protein
Mol. Mass.:
55755.10
Organism:
Homo sapiens (Human)
Description:
P56817
Residue:
501
  
Inhibitor
Name:
BDBM258274
Synonyms:
US9493485, 8-110
Type:
Small organic molecule
Emp. Form.:
C22H23F2N3OS
Mol. Mass.:
415.499
SMILES:
CC#Cc1cncc(c1)-c1csc(c1)[C@]1(C)CC2(CCC(F)(F)CC2)OC(N)=N1
: