Target
Beta-secretase 1
Ligand
BDBM258295
Substrate
Meas. Tech.
FP Assay
pH
4.5±n/a
Temperature
310.15±n/a K
IC50
50±n/a nM
Comments
extracted
Citation
 Xu, YArtis, DRBowers, SHom, RKSham, HLYuan, S Spirocyclic dihydro-thiazine and dihydro-oxazine BACE inhibitors, and compositions and uses thereof US Patent  US9493485 Publication Date 11/15/2016 
Target
Name:
Beta-secretase 1
Synonyms:
ASP2 Aspartyl protease 2 BACE1 Beta-secretase (BACE) Beta-secretase 1 (BACE 1) Beta-secretase 1 (BACE1) Beta-site amyloid precursor protein cleaving enzyme 1 Memapsin-2 beta-Secretase (BACE-1) | beta-Secretase (BACE1)
Type:
Protein
Mol. Mass.:
55755.10
Organism:
Homo sapiens (Human)
Description:
P56817
Residue:
501
  
Inhibitor
Name:
BDBM258295
Synonyms:
US9493485, 9-136
Type:
Small organic molecule
Emp. Form.:
C22H22BrF3N4O2
Mol. Mass.:
511.335
SMILES:
C[C@]1(CC2(CCC(F)(F)CC2)OC(N)=N1)c1cc(NC(=O)c2ccc(Br)cn2)ccc1F
: