Target
Cathepsin D
Ligand
BDBM258287
Substrate
Meas. Tech.
FP Assay
pH
4.5±n/a
Temperature
310.15±n/a K
IC50
>30000±n/a nM
Comments
extracted
Citation
 Xu, YArtis, DRBowers, SHom, RKSham, HLYuan, S Spirocyclic dihydro-thiazine and dihydro-oxazine BACE inhibitors, and compositions and uses thereof US Patent  US9493485 Publication Date 11/15/2016 
Target
Name:
Cathepsin D
Synonyms:
CATD_HUMAN CTSD Cathepsin D heavy chain Cathepsin D precursor
Type:
Enzyme
Mol. Mass.:
44551.72
Organism:
Homo sapiens (Human)
Description:
Human proCathepsin D (SwissProt accession number P07339) was expressed in Sf9 cells, purified, and autoactivated.
Residue:
412
  
Inhibitor
Name:
BDBM258287
Synonyms:
US9493485, 9-128
Type:
Small organic molecule
Emp. Form.:
C21H22F2N4O3
Mol. Mass.:
416.4212
SMILES:
C[C@]1(CC2(CCOCC2)OC(N)=N1)c1cc(NC(=O)c2ccc(F)cn2)ccc1F
: