Target
D-amino-acid oxidase
Ligand
BDBM258345
Substrate
Meas. Tech.
In Vitro Assay
pH
8.5±n/a
Temperature
298.15±n/a K
IC50
400±n/a nM
Comments
extracted
Citation
 Tsukamoto, TSlusher, BSFerraris, DVRojas, CHin, NDuvall, B Inhibitors of D-amino acid oxidase US Patent  US9505753 Publication Date 11/29/2016 
Target
Name:
D-amino-acid oxidase
Synonyms:
D-amino-acid oxidase (DAAO) DAMOX OXDA_HUMAN
Type:
Homodimer
Mol. Mass.:
39476.06
Organism:
Homo sapiens (Human)
Description:
P14920
Residue:
347
  
Inhibitor
Name:
BDBM258345
Synonyms:
US9505753, 10n
Type:
Small organic molecule
Emp. Form.:
C13H13N3O3
Mol. Mass.:
259.2606
SMILES:
Oc1nn(C[C@@H]2C[C@H]2c2ccccc2)c(=O)[nH]c1=O
: