Target
cGMP-specific 3',5'-cyclic phosphodiesterase
Ligand
BDBM258396
Substrate
Meas. Tech.
Inhibition Assay
pH
7.5±n/a
Temperature
298.15±n/a K
IC50
1200±n/a nM
Comments
extracted
Citation
 Follmann, MStasch, JRedlich, GGriebenow, NLang, DWunder, FHübsch, WVakalopoulos, ATersteegen, A Substituted annulated triazines and use thereof US Patent  US9505786 Publication Date 11/29/2016 
Target
Name:
cGMP-specific 3',5'-cyclic phosphodiesterase
Synonyms:
3',5'-cyclic phosphodiesterase PDE5 PDE5A_HUMAN Phosphodiesterase 5 (PDE5) Phosphodiesterase 5A (PDE5A) cGMP-specific 3',5'-cyclic phosphodiesterase
Type:
Protein
Mol. Mass.:
99975.83
Organism:
Homo sapiens (Human)
Description:
O76074
Residue:
875
  
Inhibitor
Name:
BDBM258396
Synonyms:
US9505786, 34
Type:
Small organic molecule
Emp. Form.:
C22H15FN8OS
Mol. Mass.:
458.471
SMILES:
CC1(C(=O)Nc2nc(ncc12)-c1nn(Cc2ccccc2F)c2ncccc12)c1nncs1
: