Target
cGMP-specific 3',5'-cyclic phosphodiesterase
Ligand
BDBM258402
Substrate
Meas. Tech.
Inhibition Assay
pH
7.5±n/a
Temperature
298.15±n/a K
IC50
250±n/a nM
Comments
extracted
Citation
 Follmann, MStasch, JRedlich, GGriebenow, NLang, DWunder, FHübsch, WVakalopoulos, ATersteegen, A Substituted annulated triazines and use thereof US Patent  US9505786 Publication Date 11/29/2016 
Target
Name:
cGMP-specific 3',5'-cyclic phosphodiesterase
Synonyms:
3',5'-cyclic phosphodiesterase PDE5 PDE5A_HUMAN Phosphodiesterase 5 (PDE5) Phosphodiesterase 5A (PDE5A) cGMP-specific 3',5'-cyclic phosphodiesterase
Type:
Protein
Mol. Mass.:
99975.83
Organism:
Homo sapiens (Human)
Description:
O76074
Residue:
875
  
Inhibitor
Name:
BDBM258402
Synonyms:
US9505786, 40
Type:
Small organic molecule
Emp. Form.:
C25H21FN8O
Mol. Mass.:
468.4856
SMILES:
Cn1nccc1-c1nc(nc2NC(=O)C(C)(C)c12)-c1nn(Cc2ccccc2F)c2ncccc12
: