Target
Aldo-keto reductase family 1 member C3/Glutathione S-transferase P
Ligand
BDBM258463
Substrate
Meas. Tech.
Enzyme Assay
pH
7±n/a
Temperature
295.15±n/a K
IC50
25±n/a nM
Comments
extracted
Citation
 Bothe, UBusemann, MFischer, OMBarak, NRotgeri, AMarquardt, TStegmann, C 3-substituted estra-1,3,5(10),16-tetraene derivatives, methods for the production thereof, pharmaceutical preparations containing same, and use thereof for the production of medicaments US Patent  US9512169 Publication Date 12/6/2016 
Target
Name:
Aldo-keto reductase family 1 member C3/Glutathione S-transferase P
Synonyms:
GST-Aldo-keto reductase family 1 member C3 (AKR1C3)
Type:
Enzyme
Mol. Mass.:
Description:
Components:
This complex has 2 components.
Component 1
Name:
Glutathione S-transferase P
Synonyms:
FAEES3 GST3 GSTP1-1 Glutathione S-transferase Glutathione S-transferase P Glutathione transferase (GST)
Type:
Enzyme
Mol. Mass.:
23353.53
Organism:
Homo sapiens (Human)
Description:
P09211
Residue:
210
  
Component 2
Name:
Aldo-keto reductase family 1 member C3
Synonyms:
17-beta-Hydroxysteroid Dehydrogenase 5 (17-beta-HSD5, AKR1C3) AK1C3_HUMAN Aldo-keto reductase family 1 member C3 Aldo-keto reductase family 1 member C3 (AK1C3a) Aldo-keto-reductase family 1 member C3 Dihydrodiol dehydrogenase 3 Estradiol 17-beta-dehydrogenase KIAA0119 Prostaglandin F synthase Trans-1,2-dihydrobenzene-1,2-diol dehydrogenase
Type:
Enzyme
Mol. Mass.:
36859.86
Organism:
Homo sapiens (Human)
Description:
P42330
Residue:
323
  
Inhibitor
Name:
BDBM258463
Synonyms:
US9512169, 17
Type:
Small organic molecule
Emp. Form.:
C26H30FNO3
Mol. Mass.:
423.5197
SMILES:
C[C@]12CC[C@H]3[C@@H](CCc4cc(OCC(O)CO)ccc34)[C@@H]1CC=C2c1cncc(F)c1
: