Target
Ectonucleotide pyrophosphatase/phosphodiesterase family member 2
Ligand
BDBM258489
Substrate
Meas. Tech.
Enzyme Inhibition Assay
pH
8±n/a
Temperature
303.15±n/a K
IC50
3699±n/a nM
Comments
extracted
Citation
 Hunziker, DMattei, PMauser, HPrunotto, MUllmer, C Diazaspirocycloalkane and azaspirocycloalkane US Patent  US9493486 Publication Date 11/15/2016 
Target
Name:
Ectonucleotide pyrophosphatase/phosphodiesterase family member 2
Synonyms:
ATX Autotaxin (ATX) ENPP2 Ectonucleotide Pyrophosphatase/Phosphodiesterase 2 (ENPP2) Extracellular lysophospholipase D PDNP2
Type:
Enzyme
Mol. Mass.:
99007.13
Organism:
Homo sapiens (Human)
Description:
Q13822
Residue:
863
  
Inhibitor
Name:
BDBM258489
Synonyms:
US10633384, Example 1.10 | US9493486, 1.10
Type:
Small organic molecule
Emp. Form.:
C21H21N5O3
Mol. Mass.:
391.4231
SMILES:
O=C(NC1CC2(C1)CN(C2)C(=O)c1ccc2[nH]nnc2c1)OCc1ccccc1
: