Target
Ectonucleotide pyrophosphatase/phosphodiesterase family member 2
Ligand
BDBM258508
Substrate
Meas. Tech.
Enzyme Inhibition Assay
pH
8±n/a
Temperature
303.15±n/a K
IC50
38±n/a nM
Comments
extracted
Citation
 Hunziker, DMattei, PMauser, HPrunotto, MUllmer, C Diazaspirocycloalkane and azaspirocycloalkane US Patent  US9493486 Publication Date 11/15/2016 
Target
Name:
Ectonucleotide pyrophosphatase/phosphodiesterase family member 2
Synonyms:
ATX Autotaxin (ATX) ENPP2 Ectonucleotide Pyrophosphatase/Phosphodiesterase 2 (ENPP2) Extracellular lysophospholipase D PDNP2
Type:
Enzyme
Mol. Mass.:
99007.13
Organism:
Homo sapiens (Human)
Description:
Q13822
Residue:
863
  
Inhibitor
Name:
BDBM258508
Synonyms:
BDBM258518 US9493486, 2.1
Type:
Small organic molecule
Emp. Form.:
C23H21Cl2N3O5
Mol. Mass.:
490.336
SMILES:
Clc1cc(Cl)cc(COC(=O)N2CCC3(CN(C3)C(=O)c3ccc4[nH]c(=O)oc4c3)CC2)c1
: