Target
Ectonucleotide pyrophosphatase/phosphodiesterase family member 2
Ligand
BDBM258529
Substrate
Meas. Tech.
Enzyme Inhibition Assay
pH
8±n/a
Temperature
303.15±n/a K
IC50
91±n/a nM
Comments
extracted
Citation
 Hunziker, DMattei, PMauser, HPrunotto, MUllmer, C Diazaspirocycloalkane and azaspirocycloalkane US Patent  US9493486 Publication Date 11/15/2016 
Target
Name:
Ectonucleotide pyrophosphatase/phosphodiesterase family member 2
Synonyms:
ATX Autotaxin (ATX) ENPP2 Ectonucleotide Pyrophosphatase/Phosphodiesterase 2 (ENPP2) Extracellular lysophospholipase D PDNP2
Type:
Enzyme
Mol. Mass.:
99007.13
Organism:
Homo sapiens (Human)
Description:
Q13822
Residue:
863
  
Inhibitor
Name:
BDBM258529
Synonyms:
US10633384, Example 6.8 | US9493486, 6.8
Type:
Small organic molecule
Emp. Form.:
C22H24F3N5O3
Mol. Mass.:
463.4529
SMILES:
FC(F)(F)Oc1ccc(\C=C\C(=O)N2CCC3(CC(C3)C(=O)NCc3cnn[nH]3)CC2)cc1
: