Target
Ectonucleotide pyrophosphatase/phosphodiesterase family member 2
Ligand
BDBM258530
Substrate
Meas. Tech.
Enzyme Inhibition Assay
pH
8±n/a
Temperature
303.15±n/a K
IC50
128±n/a nM
Comments
extracted
Citation
 Hunziker, DMattei, PMauser, HPrunotto, MUllmer, C Diazaspirocycloalkane and azaspirocycloalkane US Patent  US9493486 Publication Date 11/15/2016 
Target
Name:
Ectonucleotide pyrophosphatase/phosphodiesterase family member 2
Synonyms:
ATX Autotaxin (ATX) ENPP2 Ectonucleotide Pyrophosphatase/Phosphodiesterase 2 (ENPP2) Extracellular lysophospholipase D PDNP2
Type:
Enzyme
Mol. Mass.:
99007.13
Organism:
Homo sapiens (Human)
Description:
Q13822
Residue:
863
  
Inhibitor
Name:
BDBM258530
Synonyms:
US10633384, Example 6.9 | US9493486, 6.9
Type:
Small organic molecule
Emp. Form.:
C23H20ClN5O2
Mol. Mass.:
433.89
SMILES:
Clc1ccc(cc1)C#CC(=O)N1CCC2(CN(C2)C(=O)c2ccc3[nH]nnc3c2)CC1
: