Target
Ectonucleotide pyrophosphatase/phosphodiesterase family member 2
Ligand
BDBM258589
Substrate
Meas. Tech.
Enzyme Inhibition Assay
pH
8±n/a
Temperature
303.15±n/a K
IC50
100±n/a nM
Comments
extracted
Citation
 Hunziker, DMattei, PMauser, HPrunotto, MUllmer, C Diazaspirocycloalkane and azaspirocycloalkane US Patent  US9493486 Publication Date 11/15/2016 
Target
Name:
Ectonucleotide pyrophosphatase/phosphodiesterase family member 2
Synonyms:
ATX Autotaxin (ATX) ENPP2 Ectonucleotide Pyrophosphatase/Phosphodiesterase 2 (ENPP2) Extracellular lysophospholipase D PDNP2
Type:
Enzyme
Mol. Mass.:
99007.13
Organism:
Homo sapiens (Human)
Description:
Q13822
Residue:
863
  
Inhibitor
Name:
BDBM258589
Synonyms:
BDBM440744 | US9493486, 16A
Type:
Small organic molecule
Emp. Form.:
C23H25F4N5O3
Mol. Mass.:
495.4699
SMILES:
Fc1cc(ccc1COC(=O)N1CCC2(CN(C2)C(=O)[C@H]2CCc3[nH]nnc3C2)CC1)C(F)(F)F
: