Target
Beta-adrenergic receptor kinase 1
Ligand
BDBM258597
Substrate
Meas. Tech.
Competition Binding Assay
Temperature
298.15±n/a K
IC50
>20±n/a nM
Comments
extracted
Citation
 Akama, TJarnagin, KZhang, YZhou, YPlattner, JJSullivan, DC Boron-containing small molecules US Patent  US9493490 Publication Date 11/15/2016 
Target
Name:
Beta-adrenergic receptor kinase 1
Synonyms:
ADRBK1 BARK Beta-ARK-1 G-protein coupled receptor kinase 2 GRK2
Type:
Enzyme
Mol. Mass.:
79581.30
Organism:
Homo sapiens (Human)
Description:
P25098
Residue:
689
  
Inhibitor
Name:
BDBM258597
Synonyms:
US9493490, Example 9 | US9493490, F
Type:
Small organic molecule
Emp. Form.:
C16H17BFNO3
Mol. Mass.:
301.12
SMILES:
C[C@H](N)c1ccc(Oc2ccc3COB(O)c3c2C)c(F)c1
: