Target
Ribosomal protein S6 kinase alpha-1
Ligand
BDBM258599
Substrate
Meas. Tech.
Competition Binding Assay
Temperature
298.15±n/a K
IC50
25±n/a nM
Comments
extracted
Citation
 Akama, TJarnagin, KZhang, YZhou, YPlattner, JJSullivan, DC Boron-containing small molecules US Patent  US9493490 Publication Date 11/15/2016 
Target
Name:
Ribosomal protein S6 kinase alpha-1
Synonyms:
90 kDa ribosomal protein S6 kinase 1 MAP kinase-activated protein kinase 1a RPS6KA1 RPS6KA1(Kin.Dom.2 - C-terminal) RSK1 Ribosomal S6 kinase 1 Ribosomal protein S6 kinase alpha 1 Ribosomal protein S6 kinase alpha-1 (RSK1) p90-RSK 1 p90S6K | pp90RSK1
Type:
Serine/threonine-protein kinase
Mol. Mass.:
82736.10
Organism:
Homo sapiens (Human)
Description:
Residue:
735
  
Inhibitor
Name:
BDBM258599
Synonyms:
US9493490, Example 11 US9493490, tert-butyl 2-fluoro-3-(1-hydroxy-7-methyl-1,3-dihydrobenzo[c][1,2]oxaborol-6-yloxy)benzylcarbamate
Type:
Small organic molecule
Emp. Form.:
C20H23BFNO5
Mol. Mass.:
387.21
SMILES:
Cc1c2B(O)OCc2ccc1Oc1cccc(CNC(=O)OC(C)(C)C)c1F
: