Target
Ribosomal protein S6 kinase alpha-1
Ligand
BDBM258600
Substrate
Meas. Tech.
Competition Binding Assay
Temperature
298.15±n/a K
IC50
5.19±n/a nM
Comments
extracted
Citation
 Akama, TJarnagin, KZhang, YZhou, YPlattner, JJSullivan, DC Boron-containing small molecules US Patent  US9493490 Publication Date 11/15/2016 
Target
Name:
Ribosomal protein S6 kinase alpha-1
Synonyms:
90 kDa ribosomal protein S6 kinase 1 MAP kinase-activated protein kinase 1a RPS6KA1 RPS6KA1(Kin.Dom.2 - C-terminal) RSK1 Ribosomal S6 kinase 1 Ribosomal protein S6 kinase alpha 1 Ribosomal protein S6 kinase alpha-1 (RSK1) p90-RSK 1 p90S6K | pp90RSK1
Type:
Serine/threonine-protein kinase
Mol. Mass.:
82736.10
Organism:
Homo sapiens (Human)
Description:
Residue:
735
  
Inhibitor
Name:
BDBM258600
Synonyms:
US9493490, 6-(3-(aminomethyl)-2-fluorophenoxy)-7-methylbenzo[c][1,2]oxaborol-1(3H)-ol US9493490, M
Type:
Small organic molecule
Emp. Form.:
C15H15BFNO3
Mol. Mass.:
287.094
SMILES:
Cc1c2B(O)OCc2ccc1Oc1cccc(CN)c1F
: